Failed
#20250318.25 • [CI run only] Use funclets and new EH on win-x86
This run will be cleaned up after 10 days based on your project settings.
Pull request by filipnavara
0 work items0 artifacts
Failed to build "CoreCLR component".
Build • linux_musl-x64 Debug AllSubsets_CoreCLR • Build product
src/coreclr/runtime.proj(114,5): error MSB3073: (NETCORE_ENGINEERING_TELEMETRY=Build) The command "/__w/1/s/src/coreclr/"build-runtime.sh" -x64 -release -ci -cross -os linux -pgodatapath "/__w/1/s/.packages/optimization.linux-x64.pgo.coreclr/1.0.0-prerelease.25104.10" -outputrid linux-musl-x64 -cmakeargs "-DCLR_DOTNET_HOST_PATH=/__w/1/s/.dotnet/dotnet" -cmakeargs "-DCDAC_BUILD_TOOL_BINARY_PATH=/__w/1/s/artifacts/bin/coreclr/linux.x64.Release/cdac-build-tool/cdac-build-tool.dll"" exited with code 2.
Build • linux_musl-x64 Debug AllSubsets_CoreCLR • Build product
Failed to build "CoreCLR component".
Build • linux_musl-x64 Debug CoreCLR_Libraries • Build product
src/coreclr/runtime.proj(114,5): error MSB3073: (NETCORE_ENGINEERING_TELEMETRY=Build) The command "/__w/1/s/src/coreclr/"build-runtime.sh" -x64 -release -ci -cross -os linux -pgodatapath "/__w/1/s/.packages/optimization.linux-x64.pgo.coreclr/1.0.0-prerelease.25104.10" -outputrid linux-musl-x64 -cmakeargs "-DCLR_DOTNET_HOST_PATH=/__w/1/s/.dotnet/dotnet" -cmakeargs "-DCDAC_BUILD_TOOL_BINARY_PATH=/__w/1/s/artifacts/bin/coreclr/linux.x64.Release/cdac-build-tool/cdac-build-tool.dll"" exited with code 2.
Build • linux_musl-x64 Debug CoreCLR_Libraries • Build product
Failed to build "CoreCLR component".
Build • linux-x64 Debug CoreCLR_Libraries • Build product
src/coreclr/runtime.proj(114,5): error MSB3073: (NETCORE_ENGINEERING_TELEMETRY=Build) The command "/__w/1/s/src/coreclr/"build-runtime.sh" -x64 -release -ci -cross -os linux -pgodatapath "/__w/1/s/.packages/optimization.linux-x64.pgo.coreclr/1.0.0-prerelease.25104.10" -outputrid linux-x64 -cmakeargs "-DCLR_DOTNET_HOST_PATH=/__w/1/s/.dotnet/dotnet" -cmakeargs "-DCDAC_BUILD_TOOL_BINARY_PATH=/__w/1/s/artifacts/bin/coreclr/linux.x64.Release/cdac-build-tool/cdac-build-tool.dll"" exited with code 2.
Build • linux-x64 Debug CoreCLR_Libraries • Build product
Failed to build "CoreCLR component".
Build • osx-x64 Debug CoreCLR_Libraries • Build product
src/coreclr/runtime.proj(114,5): error MSB3073: (NETCORE_ENGINEERING_TELEMETRY=Build) The command "/Users/runner/work/1/s/src/coreclr/"build-runtime.sh" -x64 -release -ci -os osx -outputrid osx-x64 -cmakeargs "-DCLR_DOTNET_HOST_PATH=/Users/runner/work/1/s/.dotnet/dotnet" -cmakeargs "-DCDAC_BUILD_TOOL_BINARY_PATH=/Users/runner/work/1/s/artifacts/bin/coreclr/osx.x64.Release/cdac-build-tool/cdac-build-tool.dll"" exited with code 2.
Build • osx-x64 Debug CoreCLR_Libraries • Build product
BUILD: Error: native component build failed. Refer to the build log files for details.
Build • windows-x64 Debug CoreCLR_Libraries • Build product
src\coreclr\runtime.proj(114,5): error MSB3073: (NETCORE_ENGINEERING_TELEMETRY=Build) The command "D:\a\_work\1\s\src\coreclr\"build-runtime.cmd" -x64 -release -ci -os windows -pgodatapath "D:\a\_work\1\s\.packages\optimization.windows_nt-x64.pgo.coreclr\1.0.0-prerelease.25104.10" -outputrid win-x64 -cmakeargs "-DCLR_DOTNET_HOST_PATH=D:\a\_work\1\s\.dotnet\dotnet.exe" -cmakeargs "-DCDAC_BUILD_TOOL_BINARY_PATH=D:\a\_work\1\s\artifacts\bin\coreclr\windows.x64.Release\cdac-build-tool\cdac-build-tool.dll"" exited with code 1.
Build • windows-x64 Debug CoreCLR_Libraries • Build product
Show 1090 additional errors
Evaluate Paths
1 job completed
2m 15s
Build
Failed
1h 52m 48s
linux-arm Debug AllSubsets_CoreCLR_ReleaseRuntimeLibs
29m 24s
linux_musl-arm Debug AllSubsets_CoreCLR_ReleaseRuntimeLibs
28m 16s
linux_musl-arm64 Debug AllSubsets_CoreCLR_ReleaseRuntimeLibs
34m 14s
windows-arm64 Debug AllSubsets_CoreCLR_ReleaseRuntimeLibs
37m 9s
osx-arm64 Debug AllSubsets_CoreCLR
57m 37s
linux-arm64 Debug AllSubsets_CoreCLR
33m 10s
linux_musl-x64 Debug AllSubsets_CoreCLR
9m 55s
browser-wasm linux Debug AllSubsets_CoreCLR
20m 58s
linux_musl-x64 Debug CoreCLR_Libraries
10m 16s
linux-x64 Debug CoreCLR_Libraries
10m 40s
osx-x64 Debug CoreCLR_Libraries
14m 25s
windows-x64 Debug CoreCLR_Libraries
7m 25s
windows-x86 release CoreCLR_Libraries
39m 10s
linux-arm64 Debug Libraries_CheckedCoreCLR
52m 12s
osx-x64 Debug Libraries_CheckedCoreCLR
21m 45s
linux-x64 Debug Libraries_CheckedCoreCLR
10m 13s
windows-x64 Debug Libraries_CheckedCoreCLR
7m 54s
linux_musl-x64 Debug Libraries_CheckedCoreCLR
10m 32s
windows-x86 Debug Libraries_CheckedCoreCLR
43m 29s
osx-arm64 Debug Libraries_CheckedCoreCLR
1h 5m 43s
linux-arm checked CoreCLR_ReleaseLibraries
34m 13s
windows-x86 checked CoreCLR_ReleaseLibraries
37m 3s
windows-arm64 checked CoreCLR_ReleaseLibraries
45m 47s
linux_musl-arm checked CoreCLR_ReleaseLibraries
47m 14s
linux_musl-arm64 checked CoreCLR_ReleaseLibraries
49m 25s
linux-x64 checked CoreCLR_ReleaseLibraries
10m 35s
windows-x64 checked CoreCLR_ReleaseLibraries
8m 52s
linux-x64 checked Native_GCC
9m 48s
linux-x86 checked CoreCLR
12m 20s
linux-armel checked CoreCLR_NonPortable
19m 52s
linux-riscv64 Debug CoreCLR_TwoStage
35m 0s
linux-loongarch64 Debug CoreCLR_TwoStage
35m 36s
freebsd-x64 Debug CoreCLR_TwoStage
10m 44s
linux-x64 Debug NativeAOT
45m 6s
windows-x64 Debug NativeAOT
29m 4s
windows-x64 Checked NativeAOT
1h 20m 1s
linux-arm64 Release NativeAOT
54m 14s
linux-x64 Release NativeAOT
45m 51s
osx-x64 Release NativeAOT
39m 54s
windows-x64 Release NativeAOT
26m 58s
windows-arm64 Release NativeAOT
34m 51s
linux-arm64 Release NativeAOT_Libraries
54m 59s
osx-arm64 Release NativeAOT_Libraries
36m 39s
windows-arm64 Release NativeAOT_Libraries
36m 7s
linux-x64 checked CLR_Tools_Tests
25m 5s
windows-x64 release CrossDac
15m 8s
wasi-wasm linux release MonoAOTOffsets
browser-wasm linux release MonoAOTOffsets
android-x64 release MonoAOTOffsets
maccatalyst-x64 release MonoAOTOffsets
ios-arm64 release MonoAOTOffsets
linux-arm Debug AllSubsets_Mono
linux-arm64 Debug AllSubsets_Mono
linux-x64 Debug AllSubsets_Mono
tvossimulator-x64 Debug AllSubsets_Mono
linux_musl-x64 Release AllSubsets_Mono
osx-x64 Release AllSubsets_Mono
browser-wasm linux Release LibraryTests
browser-wasm windows Release LibraryTests
browser-wasm linux Release LibraryTests_EAT
browser-wasm linux Release LibraryTests_Smoke_AOT
browser-wasm windows Release LibraryTests_Smoke_AOT
browser-wasm linux Release SingleThreaded_BuildOnly
browser-wasm windows Release SingleThreaded_BuildOnly
browser-wasm linux Release MultiThreaded_BuildOnly
browser-wasm windows Release MultiThreaded_BuildOnly
browser-wasm linux Release AllSubsets_Mono_RuntimeTests monointerpreter
wasi-wasm linux Release WasmBuildTests
wasi-wasm windows Release WasmBuildTests
android-arm Release AllSubsets_Mono
android-arm64 Release AllSubsets_Mono
android-x64 Release AllSubsets_CoreCLR
9m 55s
android-arm64 Release AllSubsets_CoreCLR
39m 34s
tvos-arm64 Release AllSubsets_Mono
ios-arm64 Release AllSubsets_Mono
tvos-arm64 Release AllSubsets_NativeAOT
32m 56s
ios-arm64 Release AllSubsets_NativeAOT
53m 24s
maccatalyst-x64 Release AllSubsets_Mono
linux-arm64 Release AllSubsets_Mono_LLVMAOT
linux-x64 Release AllSubsets_Mono_LLVMAOT
osx-x64 Debug AllSubsets_Mono_LLVMAOT
linux-arm64 debug Mono_Runtime
linux-x64 debug Mono_Runtime
osx-arm64 debug Mono_Runtime
osx-x64 debug Mono_Runtime
windows-x64 debug Mono_Runtime
windows-x86 debug Mono_Runtime
linux-arm64 release CrossAOT_Mono crossaot
linux_musl-x64 release CrossAOT_Mono crossaot
linux_musl-arm64 release CrossAOT_Mono crossaot
linux-x64 release CrossAOT_Mono crossaot
osx-arm64 release CrossAOT_Mono crossaot
osx-x64 release CrossAOT_Mono crossaot
windows-x64 release CrossAOT_Mono crossaot
windows-arm64 release CrossAOT_Mono crossaot
windows-x86 Release Libraries_NET48
windows-x64 Debug Libraries_WithPackages
linux-arm64 Release AllSubsets_Mono_Minijit_RuntimeTests minijit
osx-x64 Release AllSubsets_Mono_Minijit_RuntimeTests minijit
windows-x64 Release AllSubsets_Mono_Minijit_RuntimeTests minijit
osx-x64 Release AllSubsets_Mono_Interpreter_RuntimeTests monointerpreter
linux-x64 Release AllSubsets_Mono_LLVMAot_RuntimeTests llvmaot
coreclr Common Pri0 Test Build AnyOS AnyCPU checked
41m 14s
linux-x64 Debug Mono_Interpreter_LibrariesTests
linux-arm64 Debug Mono_MiniJIT_LibrariesTests
linux-x64 Debug Mono_MiniJIT_LibrariesTests
osx-x64 Debug Mono_MiniJIT_LibrariesTests
Libraries Test Run release coreclr linux_musl x64 Debug
linux-x64 release Installer_Build_And_Test
Libraries Test Run release coreclr linux x64 Debug
osx-x64 release Installer_Build_And_Test
Libraries Test Run release coreclr osx x64 Debug
windows-x64 release Installer_Build_And_Test
Libraries Test Run release coreclr windows x64 Debug
windows-x86 Debug Installer_Build_And_Test
13m 38s
Libraries Test Run release coreclr windows x86 Release
Libraries Test Run checked coreclr linux arm64 Debug
52m 24s
Libraries Test Run checked coreclr osx x64 Debug
Libraries Test Run checked coreclr linux_musl x64 Debug
Libraries Test Run checked coreclr windows x86 Debug
40m 8s
Libraries Test Run checked coreclr linux_musl arm Release
31m 22s
Libraries Test Run checked coreclr linux_musl arm64 Release
48m 8s
Libraries Test Run checked coreclr linux x64 Release
Libraries Test Run checked coreclr windows x64 Release
browser-wasm linux Release WasmBuildTests
browser-wasm windows Release WasmBuildTests
coreclr Pri0 Runtime Tests Run linux arm checked
37m 25s
coreclr Pri0 Runtime Tests Run windows x86 checked
50m 4s
coreclr Pri0 Runtime Tests Run windows arm64 checked
33m 20s
coreclr Pri0 Runtime Tests Run linux arm64 checked
51m 43s
coreclr Pri0 Runtime Tests Run linux x64 checked
coreclr Pri0 Runtime Tests Run osx x64 checked
coreclr Pri0 Runtime Tests Run windows x64 checked
coreclr Pri0 Runtime Tests Run osx arm64 checked
17m 47s
Source Build Validation
Skipped