Failed
#20250324.76 • Remove most usages of the macro-based "don't return in this block" hack
This run will be cleaned up after 10 days based on your project settings.
Pull request by jkoritzinsky
0 work items0 artifacts
BUILD: Error: native component build failed. Refer to the build log files for details.
Build • windows-x64 Debug Libraries_CheckedCoreCLR • Build product
src\coreclr\runtime.proj(114,5): error MSB3073: (NETCORE_ENGINEERING_TELEMETRY=Build) The command "D:\a\_work\1\s\src\coreclr\"build-runtime.cmd" -x64 -checked -ci -os windows -outputrid win-x64 -cmakeargs "-DCLR_DOTNET_HOST_PATH=D:\a\_work\1\s\.dotnet\dotnet.exe" -cmakeargs "-DCDAC_BUILD_TOOL_BINARY_PATH=D:\a\_work\1\s\artifacts\bin\coreclr\windows.x64.Checked\cdac-build-tool\cdac-build-tool.dll"" exited with code 1.
Build • windows-x64 Debug Libraries_CheckedCoreCLR • Build product
BUILD: Error: native component build failed. Refer to the build log files for details.
Build • windows-x86 Debug Libraries_CheckedCoreCLR • Build product
src\coreclr\runtime.proj(114,5): error MSB3073: (NETCORE_ENGINEERING_TELEMETRY=Build) The command "D:\a\_work\1\s\src\coreclr\"build-runtime.cmd" -x86 -checked -ci -os windows -outputrid win-x86 -cmakeargs "-DCLR_DOTNET_HOST_PATH=D:\a\_work\1\s\.dotnet\dotnet.exe" -cmakeargs "-DCDAC_BUILD_TOOL_BINARY_PATH=D:\a\_work\1\s\artifacts\bin\coreclr\windows.x86.Checked\cdac-build-tool\cdac-build-tool.dll"" exited with code 1.
Build • windows-x86 Debug Libraries_CheckedCoreCLR • Build product
BUILD: Error: native component build failed. Refer to the build log files for details.
Build • windows-x86 checked CoreCLR_ReleaseLibraries • Build product
src\coreclr\runtime.proj(114,5): error MSB3073: (NETCORE_ENGINEERING_TELEMETRY=Build) The command "D:\a\_work\1\s\src\coreclr\"build-runtime.cmd" -x86 -checked -ci -os windows -outputrid win-x86 -cmakeargs "-DCLR_DOTNET_HOST_PATH=D:\a\_work\1\s\.dotnet\dotnet.exe" -cmakeargs "-DCDAC_BUILD_TOOL_BINARY_PATH=D:\a\_work\1\s\artifacts\bin\coreclr\windows.x86.Checked\cdac-build-tool\cdac-build-tool.dll"" exited with code 1.
Build • windows-x86 checked CoreCLR_ReleaseLibraries • Build product
BUILD: Error: native component build failed. Refer to the build log files for details.
Build • windows-x64 checked CoreCLR_ReleaseLibraries • Build product
src\coreclr\runtime.proj(114,5): error MSB3073: (NETCORE_ENGINEERING_TELEMETRY=Build) The command "D:\a\_work\1\s\src\coreclr\"build-runtime.cmd" -x64 -checked -ci -os windows -outputrid win-x64 -cmakeargs "-DCLR_DOTNET_HOST_PATH=D:\a\_work\1\s\.dotnet\dotnet.exe" -cmakeargs "-DCDAC_BUILD_TOOL_BINARY_PATH=D:\a\_work\1\s\artifacts\bin\coreclr\windows.x64.Checked\cdac-build-tool\cdac-build-tool.dll"" exited with code 1.
Build • windows-x64 checked CoreCLR_ReleaseLibraries • Build product
BUILD: Error: native component build failed. Refer to the build log files for details.
Build • windows-x64 Debug NativeAOT • Build product
src\coreclr\runtime.proj(114,5): error MSB3073: (NETCORE_ENGINEERING_TELEMETRY=Build) The command "D:\a\_work\1\s\src\coreclr\"build-runtime.cmd" -x64 -debug -ci -os windows -outputrid win-x64 -cmakeargs "-DCLR_DOTNET_HOST_PATH=D:\a\_work\1\s\.dotnet\dotnet.exe" -component alljits -component nativeaot" exited with code 1.
Build • windows-x64 Debug NativeAOT • Build product
Show 12 additional errors
Evaluate Paths
1 job completed
2m 39s
Build
Failed
2h 27m 42s
linux-arm Debug AllSubsets_CoreCLR_ReleaseRuntimeLibs
28m 31s
linux_musl-arm Debug AllSubsets_CoreCLR_ReleaseRuntimeLibs
27m 22s
linux_musl-arm64 Debug AllSubsets_CoreCLR_ReleaseRuntimeLibs
32m 40s
windows-arm64 Debug AllSubsets_CoreCLR_ReleaseRuntimeLibs
37m 32s
osx-arm64 Debug AllSubsets_CoreCLR
47m 38s
linux-arm64 Debug AllSubsets_CoreCLR
33m 1s
linux_musl-x64 Debug AllSubsets_CoreCLR
31m 39s
browser-wasm linux Debug AllSubsets_CoreCLR
20m 29s
linux_musl-x64 Debug CoreCLR_Libraries
46m 17s
linux-x64 Debug CoreCLR_Libraries
46m 39s
osx-x64 Debug CoreCLR_Libraries
44m 45s
windows-x64 Debug CoreCLR_Libraries
40m 9s
windows-x86 release CoreCLR_Libraries
40m 30s
linux-arm64 Debug Libraries_CheckedCoreCLR
51m 50s
osx-x64 Debug Libraries_CheckedCoreCLR
47m 12s
linux-x64 Debug Libraries_CheckedCoreCLR
43m 39s
windows-x64 Debug Libraries_CheckedCoreCLR
5m 46s
linux_musl-x64 Debug Libraries_CheckedCoreCLR
50m 25s
windows-x86 Debug Libraries_CheckedCoreCLR
6m 15s
osx-arm64 Debug Libraries_CheckedCoreCLR
50m 29s
linux-arm checked CoreCLR_ReleaseLibraries
33m 33s
windows-x86 checked CoreCLR_ReleaseLibraries
6m 7s
windows-arm64 checked CoreCLR_ReleaseLibraries
44m 37s
linux_musl-arm checked CoreCLR_ReleaseLibraries
43m 29s
linux_musl-arm64 checked CoreCLR_ReleaseLibraries
49m 28s
linux-x64 checked CoreCLR_ReleaseLibraries
52m 26s
windows-x64 checked CoreCLR_ReleaseLibraries
5m 22s
linux-x64 checked Native_GCC
27m 54s
linux-x86 checked CoreCLR
17m 1s
linux-armel checked CoreCLR_NonPortable
19m 54s
linux-riscv64 Debug CoreCLR_TwoStage
33m 1s
linux-loongarch64 Debug CoreCLR_TwoStage
33m 45s
freebsd-x64 Debug CoreCLR_TwoStage
37m 47s
linux-x64 Debug NativeAOT
24m 59s
windows-x64 Debug NativeAOT
4m 41s
windows-x64 Checked NativeAOT
4m 7s
linux-arm64 Release NativeAOT
29m 51s
linux-x64 Release NativeAOT
24m 43s
osx-x64 Release NativeAOT
30m 40s
windows-x64 Release NativeAOT
21m 53s
windows-arm64 Release NativeAOT
27m 8s
linux-arm64 Release NativeAOT_Libraries
30m 40s
osx-arm64 Release NativeAOT_Libraries
45m 19s
windows-arm64 Release NativeAOT_Libraries
29m 17s
linux-x64 checked CLR_Tools_Tests
24m 37s
windows-x64 release CrossDac
21m 27s
wasi-wasm linux release MonoAOTOffsets
browser-wasm linux release MonoAOTOffsets
android-x64 release MonoAOTOffsets
maccatalyst-x64 release MonoAOTOffsets
ios-arm64 release MonoAOTOffsets
linux-arm Debug AllSubsets_Mono
linux-arm64 Debug AllSubsets_Mono
linux-x64 Debug AllSubsets_Mono
tvossimulator-x64 Debug AllSubsets_Mono
linux_musl-x64 Release AllSubsets_Mono
osx-x64 Release AllSubsets_Mono
browser-wasm linux Release LibraryTests
browser-wasm windows Release LibraryTests
browser-wasm linux Release LibraryTests_EAT
browser-wasm linux Release LibraryTests_Smoke_AOT
browser-wasm windows Release LibraryTests_Smoke_AOT
browser-wasm linux Release SingleThreaded_BuildOnly
browser-wasm windows Release SingleThreaded_BuildOnly
browser-wasm linux Release MultiThreaded_BuildOnly
browser-wasm windows Release MultiThreaded_BuildOnly
browser-wasm linux Release AllSubsets_Mono_RuntimeTests monointerpreter
wasi-wasm linux Release WasmBuildTests
wasi-wasm windows Release WasmBuildTests
android-arm Release AllSubsets_Mono
android-arm64 Release AllSubsets_Mono
android-x64 Release AllSubsets_CoreCLR
43m 10s
android-arm64 Release AllSubsets_CoreCLR
28m 16s
tvos-arm64 Release AllSubsets_Mono
ios-arm64 Release AllSubsets_Mono
tvos-arm64 Release AllSubsets_NativeAOT
24m 34s
ios-arm64 Release AllSubsets_NativeAOT
43m 41s
maccatalyst-x64 Release AllSubsets_Mono
linux-arm64 Release AllSubsets_Mono_LLVMAOT
linux-x64 Release AllSubsets_Mono_LLVMAOT
osx-x64 Debug AllSubsets_Mono_LLVMAOT
linux-arm64 debug Mono_Runtime
linux-x64 debug Mono_Runtime
osx-arm64 debug Mono_Runtime
osx-x64 debug Mono_Runtime
windows-x64 debug Mono_Runtime
windows-x86 debug Mono_Runtime
linux-arm64 release CrossAOT_Mono crossaot
linux_musl-x64 release CrossAOT_Mono crossaot
linux_musl-arm64 release CrossAOT_Mono crossaot
linux-x64 release CrossAOT_Mono crossaot
osx-arm64 release CrossAOT_Mono crossaot
osx-x64 release CrossAOT_Mono crossaot
windows-x64 release CrossAOT_Mono crossaot
windows-arm64 release CrossAOT_Mono crossaot
windows-x86 Release Libraries_NET481
windows-x64 Debug Libraries_WithPackages
linux-arm64 Release AllSubsets_Mono_Minijit_RuntimeTests minijit
osx-x64 Release AllSubsets_Mono_Minijit_RuntimeTests minijit
windows-x64 Release AllSubsets_Mono_Minijit_RuntimeTests minijit
osx-x64 Release AllSubsets_Mono_Interpreter_RuntimeTests monointerpreter
linux-x64 Release AllSubsets_Mono_LLVMAot_RuntimeTests llvmaot
coreclr Common Pri0 Test Build AnyOS AnyCPU checked
38m 4s
linux-x64 Debug Mono_Interpreter_LibrariesTests
linux-arm64 Debug Mono_MiniJIT_LibrariesTests
linux-x64 Debug Mono_MiniJIT_LibrariesTests
osx-x64 Debug Mono_MiniJIT_LibrariesTests
Libraries Test Run release coreclr linux_musl x64 Debug
linux-x64 release Installer_Build_And_Test
12m 4s
Libraries Test Run release coreclr linux x64 Debug
osx-x64 release Installer_Build_And_Test
16m 1s
Libraries Test Run release coreclr osx x64 Debug
windows-x64 release Installer_Build_And_Test
13m 28s
Libraries Test Run release coreclr windows x64 Debug
windows-x86 Debug Installer_Build_And_Test
13m 49s
Libraries Test Run release coreclr windows x86 Release
Libraries Test Run checked coreclr linux arm64 Debug
45m 30s
Libraries Test Run checked coreclr osx x64 Debug
24m 6s
Libraries Test Run checked coreclr linux_musl x64 Debug
1h 23m 28s
Libraries Test Run checked coreclr windows x86 Debug
Libraries Test Run checked coreclr linux_musl arm Release
41m 24s
Libraries Test Run checked coreclr linux_musl arm64 Release
46m 13s
Libraries Test Run checked coreclr linux x64 Release
1h 27m 8s
Libraries Test Run checked coreclr windows x64 Release
browser-wasm linux Release WasmBuildTests
browser-wasm windows Release WasmBuildTests
coreclr Pri0 Runtime Tests Run linux arm checked
44m 2s
coreclr Pri0 Runtime Tests Run windows x86 checked
coreclr Pri0 Runtime Tests Run windows arm64 checked
34m 22s
coreclr Pri0 Runtime Tests Run linux arm64 checked
43m 14s
coreclr Pri0 Runtime Tests Run linux x64 checked
1h 14m 38s
coreclr Pri0 Runtime Tests Run osx x64 checked
21m 2s
coreclr Pri0 Runtime Tests Run windows x64 checked
coreclr Pri0 Runtime Tests Run osx arm64 checked
26m 2s
Source Build Validation
Skipped