This run will be cleaned up after 10 days based on your project settings.
#20250324.37 • [main] Update dependencies from dotnet/arcade
runtime
Pull request by
dotnet-maestro[bot]
Repository and version
Time started and elapsed
2h 35m 32s
Related
0 work items 0 artifacts
Tests and coverage
.packages/microsoft.dotnet.helix.sdk/10.0.0-beta.25171.1/tools/Microsoft.DotNet.Helix.Sdk.MultiQueue.targets(91,5): error : (NETCORE_ENGINEERING_TELEMETRY=Test) Work item WasmTestOnChrome-ST-System.Runtime.Tests in job f268a235-8dd4-4fea-acad-e17b353b93e7 has failed.
Failure log: https://helix.dot.net/api/2019-06-17/jobs/f268a235-8dd4-4fea-acad-e17b353b93e7/workitems/WasmTestOnChrome-ST-System.Runtime.Tests/console Build • browser-wasm linux Release LibraryTests_Smoke_AOT • Send to Helix | |||
src\mono\nuget\Microsoft.NET.Runtime.WorkloadTesting.Internal\Sdk\WorkloadTesting.Core.targets(82,5): error MSB3924: (NETCORE_ENGINEERING_TELEMETRY=Build) Failed to download file "https://dot.net/v1/dotnet-install.ps1". Beginning retry 2 in 5000ms. Received an unexpected EOF or 0 bytes from the transport stream. Build • wasi-wasm windows Release WasmBuildTests • Build product | |||
src\mono\nuget\Microsoft.NET.Runtime.WorkloadTesting.Internal\Sdk\WorkloadTesting.Core.targets(82,5): error MSB3924: (NETCORE_ENGINEERING_TELEMETRY=Build) Failed to download file "https://dot.net/v1/dotnet-install.ps1". Beginning retry 3 in 5000ms. The response ended prematurely. (ResponseEnded) Build • wasi-wasm windows Release WasmBuildTests • Build product | |||
src\mono\nuget\Microsoft.NET.Runtime.WorkloadTesting.Internal\Sdk\WorkloadTesting.Core.targets(82,5): error MSB3924: (NETCORE_ENGINEERING_TELEMETRY=Build) Failed to download file "https://dot.net/v1/dotnet-install.ps1". Beginning retry 4 in 5000ms. Received an unexpected EOF or 0 bytes from the transport stream. Build • wasi-wasm windows Release WasmBuildTests • Build product | |||
src\mono\nuget\Microsoft.NET.Runtime.WorkloadTesting.Internal\Sdk\WorkloadTesting.Core.targets(82,5): error MSB3923: (NETCORE_ENGINEERING_TELEMETRY=Build) Failed to download file "https://dot.net/v1/dotnet-install.ps1". The request was canceled due to the configured HttpClient.Timeout of 100 seconds elapsing. ---> The operation was canceled. ---> The operation was canceled. ---> Unable to read data from the transport connection: The I/O operation has been aborted because of either a thread exit or an application request.. ---> The I/O operation has been aborted because of either a thread exit or an application request. Build • wasi-wasm windows Release WasmBuildTests • Build product | |||
VSTest(0,0): error : (NETCORE_ENGINEERING_TELEMETRY=Build) Tests failed: /__w/1/s/artifacts/TestResults/Release/Microsoft.NET.HostModel.Tests_net10.0_x64.html [net10.0|x64] Build • linux-x64 release Installer_Build_And_Test • Build product | |||
VSTest(0,0): error : (NETCORE_ENGINEERING_TELEMETRY=Build) Tests failed: /__w/1/s/artifacts/TestResults/Release/AppHost.Bundle.Tests_net10.0_x64.html [net10.0|x64] Build • linux-x64 release Installer_Build_And_Test • Build product | |||
VSTest(0,0): error : (NETCORE_ENGINEERING_TELEMETRY=Build) Tests failed: /__w/1/s/artifacts/TestResults/Release/HostActivation.Tests_net10.0_x64.html [net10.0|x64] Build • linux-x64 release Installer_Build_And_Test • Build product | |||
VSTest(0,0): error : (NETCORE_ENGINEERING_TELEMETRY=Build) Tests failed: /Users/runner/work/1/s/artifacts/TestResults/Release/Microsoft.NET.HostModel.Tests_net10.0_x64.html [net10.0|x64] Build • osx-x64 release Installer_Build_And_Test • Build product | |||
VSTest(0,0): error : (NETCORE_ENGINEERING_TELEMETRY=Build) Tests failed: /Users/runner/work/1/s/artifacts/TestResults/Release/AppHost.Bundle.Tests_net10.0_x64.html [net10.0|x64] Build • osx-x64 release Installer_Build_And_Test • Build product | |||
Show 9 additional errors | |||
Evaluate Paths
1 job completed
2m 15sSource Build Validation
Skipped